Reaction Details
TargetApoptosis regulator Bcl-2
LigandBDBM161495
Substrate/Competitorn/a
Meas. Tech.Fluorescence Polarisation Assay
pH7.4±n/a
IC50 4.1±n/a nM
Commentsextracted
Citation Le Tiran, ALe Diguarher, TStarck, JHenlin, JGuillouzic, ADe Nanteuil, GGeneste, OFejes, ITatai, JNyerges, MDavidson, JEMurray, JBChen, IDurand, D Pyrrole compounds, a process for their preparation and pharmaceutical compositions containing them US Patent US9108983 Publication Date 8/18/2015
 
Apoptosis regulator Bcl-2
Name:Apoptosis regulator Bcl-2
Type:Homodimer or heterodimer
Mol. Mass.:26269.11
Organism:Homo sapiens (Human)
Description:P10415
Residue:239
BDBM161495
NameBDBM161495
Synonyms:US9108983, Example 26
TypeSmall organic molecule
Emp. Form.C37H38N6O5
Mol. Mass.646.7348
SMILESCNCCn1c(C)c(cc1-c1cc2OCOc2cc1C(=O)N1Cc2ccccc2C[C@H]1C)C(=O)N(c1cnn(C)c1)c1ccc(O)cc1