Reaction Details
TargetApoptosis regulator Bcl-2
LigandBDBM161494
Substrate/Competitorn/a
Meas. Tech.Fluorescence Polarisation Assay
pH7.4±n/a
IC50 2.9±n/a nM
Commentsextracted
Citation Le Tiran, ALe Diguarher, TStarck, JHenlin, JGuillouzic, ADe Nanteuil, GGeneste, OFejes, ITatai, JNyerges, MDavidson, JEMurray, JBChen, IDurand, D Pyrrole compounds, a process for their preparation and pharmaceutical compositions containing them US Patent US9108983 Publication Date 8/18/2015
 
Apoptosis regulator Bcl-2
Name:Apoptosis regulator Bcl-2
Type:Homodimer or heterodimer
Mol. Mass.:26269.11
Organism:Homo sapiens (Human)
Description:P10415
Residue:239
BDBM161494
NameBDBM161494
Synonyms:US9108983, Example 25 | US9108983, Example 416
TypeSmall organic molecule
Emp. Form.C38H39ClN6O4
Mol. Mass.679.207
SMILESCc1c(cc(-c2cc(Cl)ccc2C(=O)N2Cc3ccccc3C[C@H]2CN2CCOCC2)n1C)C(=O)N(c1cnn(C)c1)c1ccc(O)cc1