Reaction Details
TargetApoptosis regulator Bcl-2
LigandBDBM161600
Substrate/Competitorn/a
Meas. Tech.Fluorescence Polarisation Assay
pH7.4±n/a
IC50 3±n/a nM
Commentsextracted
Citation Le Tiran, ALe Diguarher, TStarck, JHenlin, JGuillouzic, ADe Nanteuil, GGeneste, OFejes, ITatai, JNyerges, MDavidson, JEMurray, JBChen, IDurand, D Pyrrole compounds, a process for their preparation and pharmaceutical compositions containing them US Patent US9108983 Publication Date 8/18/2015
 
Apoptosis regulator Bcl-2
Name:Apoptosis regulator Bcl-2
Type:Homodimer or heterodimer
Mol. Mass.:26269.11
Organism:Homo sapiens (Human)
Description:P10415
Residue:239
BDBM161600
NameBDBM161600
Synonyms:US9108983, Example 417
TypeSmall organic molecule
Emp. Form.C42H44N6O5
Mol. Mass.712.836
SMILESCOc1ccc(-c2cc(C(=O)N(c3cc(C#N)n(C)c3C)c3ccc(O)cc3)c(C)n2C)c(c1)C(=O)N1Cc2ccccc2C[C@H]1CN1CCOCC1