Reaction Details
TargetE3 ubiquitin-protein ligase Mdm2
LigandBDBM161875
Substrate/Competitorn/a
Meas. Tech.Time Resolved Fluorescence Energy Transfer (TR-FRET) Assay
IC50 9.1±n/a nM
Citation Berghausen, JBuschmann, NFuret, PGessier, FHergovich Lisztwan, JHolzer, PJacoby, EKallen, JMasuya, KPissot Soldermann, CRen, HStutz, S Substituted isoquinolinones and quinazolinones US Patent US9051279 Publication Date 6/9/2015
 
E3 ubiquitin-protein ligase Mdm2
Name:E3 ubiquitin-protein ligase Mdm2
Type:Oncoprotein
Mol. Mass.:55196.54
Organism:Homo sapiens (Human)
Description:Q00987
Residue:491
BDBM161875
NameBDBM161875
Synonyms:US9051279, 46
TypeSmall organic molecule
Emp. Form.C34H42ClN3O3
Mol. Mass.576.169
SMILESCC[C@@H](C)Oc1cc2C(N(C(=O)Cc2cc1OC)c1ccc(cc1)N(C)CC1CCCN(C)C1)c1ccc(Cl)cc1