Reaction Details
TargetE3 ubiquitin-protein ligase Mdm2
LigandBDBM162072
Substrate/Competitorn/a
Meas. Tech.Time Resolved Fluorescence Energy Transfer (TR-FRET) Assay
IC50 2.9±n/a nM
Citation Berghausen, JBuschmann, NFuret, PGessier, FHergovich Lisztwan, JHolzer, PJacoby, EKallen, JMasuya, KPissot Soldermann, CRen, HStutz, S Substituted isoquinolinones and quinazolinones US Patent US9051279 Publication Date 6/9/2015
 
E3 ubiquitin-protein ligase Mdm2
Name:E3 ubiquitin-protein ligase Mdm2
Type:Oncoprotein
Mol. Mass.:55196.54
Organism:Homo sapiens (Human)
Description:Q00987
Residue:491
BDBM162072
NameBDBM162072
Synonyms:US9051279, 80
TypeSmall organic molecule
Emp. Form.C37H46ClN3O5
Mol. Mass.648.231
SMILESCOC(=O)CN(C)[C@H]1CC[C@H](CN(C)c2ccc(cc2)N2[C@@H](c3ccc(Cl)cc3)c3cc(OC(C)C)c(OC)cc3CC2=O)CC1