Reaction Details
TargetE3 ubiquitin-protein ligase Mdm2
LigandBDBM162141
Substrate/Competitorn/a
Meas. Tech.Time Resolved Fluorescence Energy Transfer (TR-FRET) Assay
IC50 5.7±n/a nM
Citation Berghausen, JBuschmann, NFuret, PGessier, FHergovich Lisztwan, JHolzer, PJacoby, EKallen, JMasuya, KPissot Soldermann, CRen, HStutz, S Substituted isoquinolinones and quinazolinones US Patent US9051279 Publication Date 6/9/2015
 
E3 ubiquitin-protein ligase Mdm2
Name:E3 ubiquitin-protein ligase Mdm2
Type:Oncoprotein
Mol. Mass.:55196.54
Organism:Homo sapiens (Human)
Description:Q00987
Residue:491
BDBM162141
NameBDBM162141
Synonyms:US9051279, 124
TypeSmall organic molecule
Emp. Form.C36H44ClN5O4
Mol. Mass.646.219
SMILESCOc1cc2CC(=O)N([C@@H](c3ccc(Cl)cc3)c2cc1OC(C)C)c1ccc(cn1)N(C)C[C@H]1CC[C@@H](CC1)N1CN(C)C(=O)C1