Reaction Details
TargetE3 ubiquitin-protein ligase Mdm2
LigandBDBM162222
Substrate/Competitorn/a
Meas. Tech.Time Resolved Fluorescence Energy Transfer (TR-FRET) Assay
IC50 3.8±n/a nM
Citation Berghausen, JBuschmann, NFuret, PGessier, FHergovich Lisztwan, JHolzer, PJacoby, EKallen, JMasuya, KPissot Soldermann, CRen, HStutz, S Substituted isoquinolinones and quinazolinones US Patent US9051279 Publication Date 6/9/2015
 
E3 ubiquitin-protein ligase Mdm2
Name:E3 ubiquitin-protein ligase Mdm2
Type:Oncoprotein
Mol. Mass.:55196.54
Organism:Homo sapiens (Human)
Description:Q00987
Residue:491
BDBM162222
NameBDBM162222
Synonyms:US9051279, 205
TypeSmall organic molecule
Emp. Form.C38H46ClN5O5
Mol. Mass.688.255
SMILESCOc1cc2CC(=O)N([C@@H](c3ccc(Cl)cc3)c2cc1OCC1CCCO1)c1ccc(nc1)N(C)C[C@H]1CC[C@@H](CC1)N1CN(C)C(=O)C1