Reaction Details
TargetProtein Mdm4
LigandBDBM161883
Substrate/Competitorn/a
Meas. Tech.Time Resolved Fluorescence Energy Transfer (TR-FRET) Assay
IC50 2300±n/a nM
Citation Berghausen, JBuschmann, NFuret, PGessier, FHergovich Lisztwan, JHolzer, PJacoby, EKallen, JMasuya, KPissot Soldermann, CRen, HStutz, S Substituted isoquinolinones and quinazolinones US Patent US9051279 Publication Date 6/9/2015
 
Protein Mdm4
Name:Protein Mdm4
Type:Oncoprotein
Mol. Mass.:54842.04
Organism:Homo sapiens (Human)
Description:The HDMX(1-188) were expressed in Escherichia coli BL21 (DE3) as a GST fusion and purified on glutathione sepharose.
Residue:490
BDBM161883
NameBDBM161883
Synonyms:US9051279, 53
TypeSmall organic molecule
Emp. Form.C37H48ClN3O3
Mol. Mass.618.248
SMILESCC[C@@H](C)Oc1cc2C(N(C(=O)Cc2cc1OC)c1ccc(cc1)N(C)C[C@H]1CC[C@@H](CC1)N(C)CC)c1ccc(Cl)cc1