Reaction Details
TargetProtein Mdm4
LigandBDBM162151
Substrate/Competitorn/a
Meas. Tech.Time Resolved Fluorescence Energy Transfer (TR-FRET) Assay
IC50 5090±n/a nM
Citation Berghausen, JBuschmann, NFuret, PGessier, FHergovich Lisztwan, JHolzer, PJacoby, EKallen, JMasuya, KPissot Soldermann, CRen, HStutz, S Substituted isoquinolinones and quinazolinones US Patent US9051279 Publication Date 6/9/2015
 
Protein Mdm4
Name:Protein Mdm4
Type:Oncoprotein
Mol. Mass.:54842.04
Organism:Homo sapiens (Human)
Description:The HDMX(1-188) were expressed in Escherichia coli BL21 (DE3) as a GST fusion and purified on glutathione sepharose.
Residue:490
BDBM162151
NameBDBM162151
Synonyms:US9051279, 134
TypeSmall organic molecule
Emp. Form.C37H46ClN5O4
Mol. Mass.660.245
SMILESCCN1CN(CC1=O)[C@H]1CC[C@H](CN(C)c2ccc(cn2)N2[C@@H](c3ccc(Cl)cc3)c3cc(OC(C)C)c(OC)cc3CC2=O)CC1