Reaction Details
TargetProtein Mdm4
LigandBDBM162222
Substrate/Competitorn/a
Meas. Tech.Time Resolved Fluorescence Energy Transfer (TR-FRET) Assay
IC50 1560±n/a nM
Citation Berghausen, JBuschmann, NFuret, PGessier, FHergovich Lisztwan, JHolzer, PJacoby, EKallen, JMasuya, KPissot Soldermann, CRen, HStutz, S Substituted isoquinolinones and quinazolinones US Patent US9051279 Publication Date 6/9/2015
 
Protein Mdm4
Name:Protein Mdm4
Type:Oncoprotein
Mol. Mass.:54842.04
Organism:Homo sapiens (Human)
Description:The HDMX(1-188) were expressed in Escherichia coli BL21 (DE3) as a GST fusion and purified on glutathione sepharose.
Residue:490
BDBM162222
NameBDBM162222
Synonyms:US9051279, 205
TypeSmall organic molecule
Emp. Form.C38H46ClN5O5
Mol. Mass.688.255
SMILESCOc1cc2CC(=O)N([C@@H](c3ccc(Cl)cc3)c2cc1OCC1CCCO1)c1ccc(nc1)N(C)C[C@H]1CC[C@@H](CC1)N1CN(C)C(=O)C1