Reaction Details
TargetMitogen-activated protein kinase kinase kinase 5
LigandBDBM162312
Substrate/Competitorn/a
Meas. Tech.Time-Resolved Fluorescence Resonance Energy Transfer (TR-FRET) Assay
IC50 2.62±0.0 nM
Citation Notte, G Apoptosis signal-regulating kinase inhibitors US Patent US9051313 Publication Date 6/9/2015
 
Mitogen-activated protein kinase kinase kinase 5
Name:Mitogen-activated protein kinase kinase kinase 5
Type:Protein
Mol. Mass.:154514.93
Organism:Homo sapiens (Human)
Description:Q99683
Residue:1374
BDBM162312
NameBDBM162312
Synonyms:US9051313, 3
TypeSmall organic molecule
Emp. Form.C24H24F3N9O2S
Mol. Mass.559.567
SMILESC[C@H](n1cnnc1-c1nc(NC(=O)c2cc(c(cn2)N2CCOCC2)-n2cnc(c2)C2CC2)cs1)C(F)(F)F