Reaction Details
TargetMitogen-activated protein kinase kinase kinase 5
LigandBDBM162315
Substrate/Competitorn/a
Meas. Tech.Time-Resolved Fluorescence Resonance Energy Transfer (TR-FRET) Assay
IC50 2.4±0.0 nM
Citation Notte, G Apoptosis signal-regulating kinase inhibitors US Patent US9051313 Publication Date 6/9/2015
 
Mitogen-activated protein kinase kinase kinase 5
Name:Mitogen-activated protein kinase kinase kinase 5
Type:Protein
Mol. Mass.:154514.93
Organism:Homo sapiens (Human)
Description:Q99683
Residue:1374
BDBM162315
NameBDBM162315
Synonyms:US10307427, Compound 6 | US9051313, 6
TypeSmall organic molecule
Emp. Form.C23H23N9OS
Mol. Mass.473.553
SMILESO=C(Nc1csc(n1)-c1nncn1C1CC1)c1cc(c(cn1)N1CCC1)-n1cnc(c1)C1CC1