Reaction Details
TargetMitogen-activated protein kinase kinase kinase 5
LigandBDBM162318
Substrate/Competitorn/a
Meas. Tech.Time-Resolved Fluorescence Resonance Energy Transfer (TR-FRET) Assay
IC50 1.9±0.0 nM
Citation Notte, G Apoptosis signal-regulating kinase inhibitors US Patent US9051313 Publication Date 6/9/2015
 
Mitogen-activated protein kinase kinase kinase 5
Name:Mitogen-activated protein kinase kinase kinase 5
Type:Protein
Mol. Mass.:154514.93
Organism:Homo sapiens (Human)
Description:Q99683
Residue:1374
BDBM162318
NameBDBM162318
Synonyms:US10307427, Compound 9 | US9051313, 9
TypeSmall organic molecule
Emp. Form.C24H25N9OS
Mol. Mass.487.58
SMILESO=C(Nc1csc(n1)-c1nncn1C1CC1)c1cc(c(cn1)N1CCCC1)-n1cnc(c1)C1CC1