Reaction Details
TargetHistone deacetylase 4
LigandBDBM162848
Substrate/Competitorn/a
Meas. Tech.Inhibition Assay
pH8±n/a
Temperature298.15±n/a K
IC50 1±n/a nM
Commentsextracted
Citation Hebach, CJoly, EKallen, JTernois, JGTintelnot-Blomley, M Trifluoromethyl-oxadiazole derivatives and their use in the treatment of disease US Patent US9056843 Publication Date 6/16/2015
 
Histone deacetylase 4
Name:Histone deacetylase 4
Type:Enzyme
Mol. Mass.:119049.39
Organism:Homo sapiens (Human)
Description:P56524
Residue:1084
BDBM162848
NameBDBM162848
Synonyms:US9056843, 139
TypeSmall organic molecule
Emp. Form.C17H21F3N4O2
Mol. Mass.370.3694
SMILESCCCN(C)C[C@@H](C)NC(=O)c1ccc(cc1)-c1noc(n1)C(F)(F)F