Reaction Details
TargetATP-sensitive inward rectifier potassium channel 1
LigandBDBM50442600
Substrate/Competitorn/a
Meas. Tech.Electrophysiology Assay
pH7.4±n/a
IC50 65±n/a nM
Commentsextracted
Citation Pasternak, AdeJesus, RKZhu, YYang, LWalsh, STang, HKim, DPio, BShahripour, ABelyk, K Inhibitors of the renal outer medullary potassium channel US Patent US9056859 Publication Date 6/16/2015
 
ATP-sensitive inward rectifier potassium channel 1
Name:ATP-sensitive inward rectifier potassium channel 1
Type:Enzyme
Mol. Mass.:44976.27
Organism:Rattus norvegicus (Rat)
Description:P35560
Residue:391
BDBM50442600
NameBDBM50442600
Synonyms:CHEMBL2441437 | US9056859, 1
TypeSmall organic molecule
Emp. Form.C23H24N6O3
Mol. Mass.432.4751
SMILESO=C(Cc1ccc(cc1)-n1cnnn1)N1CCN(CCc2ccc3C(=O)OCc3c2)CC1