Reaction Details
TargetATP-sensitive inward rectifier potassium channel 1
LigandBDBM162871
Substrate/Competitorn/a
Meas. Tech.Electrophysiology Assay
pH7.4±n/a
IC50 94±n/a nM
Commentsextracted
Citation Pasternak, AdeJesus, RKZhu, YYang, LWalsh, STang, HKim, DPio, BShahripour, ABelyk, K Inhibitors of the renal outer medullary potassium channel US Patent US9056859 Publication Date 6/16/2015
 
ATP-sensitive inward rectifier potassium channel 1
Name:ATP-sensitive inward rectifier potassium channel 1
Type:Enzyme
Mol. Mass.:44976.27
Organism:Rattus norvegicus (Rat)
Description:P35560
Residue:391
BDBM162871
NameBDBM162871
Synonyms:US9056859, 59
TypeSmall organic molecule
Emp. Form.C24H23F2N3O3
Mol. Mass.439.4545
SMILESCc1c2COC(=O)c2ccc1CCN1CCN(CC1)C(=O)Cc1cc(F)c(cc1F)C#N