Reaction Details
TargetSmoothened homolog
LigandBDBM163000
Substrate/Competitorn/a
Meas. Tech.Radioligand Competition Binding Assay
Temperature298.15±n/a K
IC50 11.5±n/a nM
Commentsextracted
Citation Nair, SKPlanken, SP Pyridine-2-derivatives as smoothened receptor modulators US Patent US9056865 Publication Date 6/16/2015
 
Smoothened homolog
Name:Smoothened homolog
Type:Protein
Mol. Mass.:86415.51
Organism:Homo sapiens (Human)
Description:Q99835
Residue:787
BDBM163000
NameBDBM163000
Synonyms:US9056865, A-127
TypeSmall organic molecule
Emp. Form.C20H25ClN4O2S
Mol. Mass.420.956
SMILESCc1cnc(c(C)c1)-c1cc(ncc1Cl)N1CCC(CC1)NS(=O)(=O)C1CC1