Reaction Details
TargetSmoothened homolog
LigandBDBM163029
Substrate/Competitorn/a
Meas. Tech.Radioligand Competition Binding Assay
Temperature298.15±n/a K
IC50 12.1±n/a nM
Commentsextracted
Citation Nair, SKPlanken, SP Pyridine-2-derivatives as smoothened receptor modulators US Patent US9056865 Publication Date 6/16/2015
 
Smoothened homolog
Name:Smoothened homolog
Type:Protein
Mol. Mass.:86415.51
Organism:Homo sapiens (Human)
Description:Q99835
Residue:787
BDBM163029
NameBDBM163029
Synonyms:US9056865, A-156
TypeSmall organic molecule
Emp. Form.C24H33N5O2
Mol. Mass.423.5511
SMILESC[C@H]1CN(CC(=O)N2CCN(CC2)c2cc(ccn2)-c2ncc(C)cc2C)C[C@@H](C)O1