Reaction Details
TargetGenome polyprotein
LigandBDBM163034
Substrate/Competitorn/a
Meas. Tech.Radiolabeled Nucleotide Incorporation Assay
pH7.3±n/a
Temperature298.15±n/a K
Ki 60±n/a nM
Commentsextracted
Citation Girijavallabhan, VNjoroge, FGBogen, SVerma, VBennett, FKerekes, AArasappan, APissarnitski, DDang, QDavies, IOlsen, DBStamford, AVacca, JP 2′-substituted nucleoside derivatives and methods of use thereof for the treatment of viral diseases US Patent US9061041 Publication Date 6/23/2015
 
Genome polyprotein
Name:Genome polyprotein
Type:Protease Domain
Mol. Mass.:327221.49
Organism:Hepatitis C virus (HCV genotype 1a, isolate H)
Description:P27958
Residue:3011
BDBM163034
NameBDBM163034
Synonyms:US9061041, 99
TypeSmall organic molecule
Emp. Form.C15H23N6O6P
Mol. Mass.414.3535
SMILESCOc1nc(N)nc2n(cnc12)[C@@H]1O[C@@H]2COP(=O)(OC(C)C)O[C@H]2[C@@]1(C)N