Reaction Details
TargetHistone deacetylase 1
LigandBDBM163619
Substrate/Competitorn/a
Meas. Tech.HDAC Fluorescent Assays
pH8±n/a
IC50 5e+2±n/a nM
Commentsextracted
Citation Wang, YStowe, RLPinello, CETian, GMadoux, FLi, DZhao, LYLi, JLWang, YWang, YMa, HHodder, PRoush, WRLiao, D Identification of histone deacetylase inhibitors with benzoylhydrazide scaffold that selectively inhibit class I histone deacetylases. Chem Biol22:273-84 (2015) 
 
Histone deacetylase 1
Name:Histone deacetylase 1
Type:Enzyme
Mol. Mass.:55090.27
Organism:Homo sapiens (Human)
Description:Q13547
Residue:482
BDBM163619
NameBDBM163619
Synonyms:UF010 US11731934, Compound UF010
TypeSmall organic molecule
Emp. Form.C11H15BrN2O
Mol. Mass.271.154
SMILESCCCCNNC(=O)c1ccc(Br)cc1