Reaction Details
TargetHistone deacetylase 4
LigandBDBM163619
Substrate/Competitorn/a
Meas. Tech.HDAC Fluorescent Assays
pH8±n/a
IC50>1.00e+5±n/a nM
Commentsextracted
Citation Wang, YStowe, RLPinello, CETian, GMadoux, FLi, DZhao, LYLi, JLWang, YWang, YMa, HHodder, PRoush, WRLiao, D Identification of histone deacetylase inhibitors with benzoylhydrazide scaffold that selectively inhibit class I histone deacetylases. Chem Biol22:273-84 (2015) 
 
Histone deacetylase 4
Name:Histone deacetylase 4
Type:Enzyme
Mol. Mass.:119049.39
Organism:Homo sapiens (Human)
Description:P56524
Residue:1084
BDBM163619
NameBDBM163619
Synonyms:UF010 US11731934, Compound UF010
TypeSmall organic molecule
Emp. Form.C11H15BrN2O
Mol. Mass.271.154
SMILESCCCCNNC(=O)c1ccc(Br)cc1