Reaction Details
TargetHistone deacetylase 7
LigandBDBM163619
Substrate/Competitorn/a
Meas. Tech.HDAC Fluorescent Assays
pH8±n/a
IC50>1.00e+5±n/a nM
Commentsextracted
Citation Wang, YStowe, RLPinello, CETian, GMadoux, FLi, DZhao, LYLi, JLWang, YWang, YMa, HHodder, PRoush, WRLiao, D Identification of histone deacetylase inhibitors with benzoylhydrazide scaffold that selectively inhibit class I histone deacetylases. Chem Biol22:273-84 (2015) 
 
Histone deacetylase 7
Name:Histone deacetylase 7
Type:Chromatin regulator; hydrolase; repressor
Mol. Mass.:102942.62
Organism:Homo sapiens (Human)
Description:Q8WUI4
Residue:952
BDBM163619
NameBDBM163619
Synonyms:UF010 US11731934, Compound UF010
TypeSmall organic molecule
Emp. Form.C11H15BrN2O
Mol. Mass.271.154
SMILESCCCCNNC(=O)c1ccc(Br)cc1