Reaction Details
TargetHistone deacetylase 6
LigandBDBM163624
Substrate/Competitorn/a
Meas. Tech.HDAC Activity Assays
IC50 9.57e+3±n/a nM
Citation Wang, YStowe, RLPinello, CETian, GMadoux, FLi, DZhao, LYLi, JLWang, YWang, YMa, HHodder, PRoush, WRLiao, D Identification of histone deacetylase inhibitors with benzoylhydrazide scaffold that selectively inhibit class I histone deacetylases. Chem Biol22:273-84 (2015) 
 
Histone deacetylase 6
Name:Histone deacetylase 6
Type:Chromatin regulator; hydrolase; repressor
Mol. Mass.:131381.51
Organism:Homo sapiens (Human)
Description:Q9UBN7
Residue:1215
BDBM163624
NameBDBM163624
Synonyms:SR-3208 US11731934, Compound RLS2-131
TypeSmall organic molecule
Emp. Form.C13H21N3O
Mol. Mass.235.3253
SMILESCCCCNNC(=O)c1ccc(cc1)N(C)C