Reaction Details
TargetHistone deacetylase 1/Nuclear receptor corepressor 2 [395-498]
LigandBDBM163626
Substrate/Competitorn/a
Meas. Tech.HDAC Activity Assays
IC50 1.9e+2±n/a nM
Citation Wang, YStowe, RLPinello, CETian, GMadoux, FLi, DZhao, LYLi, JLWang, YWang, YMa, HHodder, PRoush, WRLiao, D Identification of histone deacetylase inhibitors with benzoylhydrazide scaffold that selectively inhibit class I histone deacetylases. Chem Biol22:273-84 (2015) 
 
Histone deacetylase 1/Nuclear receptor corepressor 2 [395-498]
Name:Histone deacetylase 1/Nuclear receptor corepressor 2 [395-498]
Synonyms:HDAC1/NCOR2
Type:Protein
Mol. Mass.:n/a
Description:BPS Bioscience
Components:This complex has 2 components.
Component 1
Name:Histone deacetylase 1
Type:Enzyme
Mol. Mass.:55090.27
Organism:Homo sapiens (Human)
Description:Q13547
Residue:482
Component 2
Name:Nuclear receptor corepressor 2 [395-498]
Synonyms:CTG26 NCOR2 Nuclear receptor corepressor 2
Type:Protein
Mol. Mass.:12719.17
Organism:Homo sapiens (Human)
Description:Deacetylase activation domain of human NCOR2 (395-498aa)
Residue:104
BDBM163626
NameBDBM163626
Synonyms:SR-3302 US11731934, Compound RLS2-211
TypeSmall organic molecule
Emp. Form.C15H24N2O
Mol. Mass.248.3639
SMILESCCCCNNC(=O)c1ccc(cc1)C(C)(C)C