Reaction Details
TargetHistone deacetylase 6
LigandBDBM163628
Substrate/Competitorn/a
Meas. Tech.HDAC Activity Assays
IC50 4.63e+3±n/a nM
Citation Wang, YStowe, RLPinello, CETian, GMadoux, FLi, DZhao, LYLi, JLWang, YWang, YMa, HHodder, PRoush, WRLiao, D Identification of histone deacetylase inhibitors with benzoylhydrazide scaffold that selectively inhibit class I histone deacetylases. Chem Biol22:273-84 (2015) 
 
Histone deacetylase 6
Name:Histone deacetylase 6
Type:Chromatin regulator; hydrolase; repressor
Mol. Mass.:131381.51
Organism:Homo sapiens (Human)
Description:Q9UBN7
Residue:1215
BDBM163628
NameBDBM163628
Synonyms:SR-3212 US11731934, Compound RLS2-137
TypeSmall organic molecule
Emp. Form.C10H13BrN2O
Mol. Mass.257.127
SMILESCCCNNC(=O)c1ccc(Br)cc1