Reaction Details
TargetHistone deacetylase 3/Nuclear receptor corepressor 2 [395-498]
LigandBDBM163634
Substrate/Competitorn/a
Meas. Tech.HDAC Activity Assays
IC50>5.0e+4±n/a nM
Citation Wang, YStowe, RLPinello, CETian, GMadoux, FLi, DZhao, LYLi, JLWang, YWang, YMa, HHodder, PRoush, WRLiao, D Identification of histone deacetylase inhibitors with benzoylhydrazide scaffold that selectively inhibit class I histone deacetylases. Chem Biol22:273-84 (2015) 
 
Histone deacetylase 3/Nuclear receptor corepressor 2 [395-498]
Name:Histone deacetylase 3/Nuclear receptor corepressor 2 [395-498]
Synonyms:HDAC3/NCOR2
Type:Protein
Mol. Mass.:n/a
Description:BPS Bioscience
Components:This complex has 2 components.
Component 1
Name:Histone deacetylase 3
Type:Enzyme
Mol. Mass.:48829.55
Organism:Homo sapiens (Human)
Description:O15379
Residue:428
Component 2
Name:Nuclear receptor corepressor 2 [395-498]
Synonyms:CTG26 NCOR2 Nuclear receptor corepressor 2
Type:Protein
Mol. Mass.:12719.17
Organism:Homo sapiens (Human)
Description:Deacetylase activation domain of human NCOR2 (395-498aa)
Residue:104
BDBM163634
NameBDBM163634
Synonyms:SR-3365 US11731934, Compound RLS2-257
TypeSmall organic molecule
Emp. Form.C15H21BrN2O
Mol. Mass.325.244
SMILESBrc1ccc(cc1)C(=O)NNCCCC1CCCC1