Reaction Details
TargetBeta-glucuronidase
LigandBDBM163645
Substrate/Competitorn/a
Meas. Tech.Inhibition Assays
Ki 6.1e+2± 2e+2 nM
Citation Wallace, BDRoberts, ABPollet, RMIngle, JDBiernat, KAPellock, SJVenkatesh, MKGuthrie, LO'Neal, SKRobinson, SJDollinger, MFigueroa, EMcShane, SRCohen, RDJin, JFrye, SVZamboni, WCPepe-Ranney, CMani, SKelly, LRedinbo, MR Structure and Inhibition of Microbiome ß-Glucuronidases Essential to the Alleviation of Cancer Drug Toxicity. Chem Biol22:1238-49 (2015) 
 
Beta-glucuronidase
Name:Beta-glucuronidase
Type:Protein
Mol. Mass.:68431.57
Organism:Escherichia coli (Enterobacteria)
Description:P05804
Residue:603
BDBM163645
NameBDBM163645
Synonyms:3[(6,8Dimethyl2oxo1Hquinolin3yl)methyl]3(2hydroxyethyl)1[4(morpholin4yl)phenyl]thiourea (Inhibitor R3)
TypeSmall organic molecule
Emp. Form.C25H30N4O3S
Mol. Mass.466.596
SMILESCc1cc(C)c2[nH]c(=O)c(CN(CCO)C(=S)Nc3ccc(cc3)N3CCOCC3)cc2c1