Reaction Details
TargetBeta-glucuronidase
LigandBDBM163637
Substrate/Competitorn/a
Meas. Tech.Inhibition Assays
Ki 2.1e+2± 3e+1 nM
Citation Wallace, BDRoberts, ABPollet, RMIngle, JDBiernat, KAPellock, SJVenkatesh, MKGuthrie, LO'Neal, SKRobinson, SJDollinger, MFigueroa, EMcShane, SRCohen, RDJin, JFrye, SVZamboni, WCPepe-Ranney, CMani, SKelly, LRedinbo, MR Structure and Inhibition of Microbiome ß-Glucuronidases Essential to the Alleviation of Cancer Drug Toxicity. Chem Biol22:1238-49 (2015) 
 
Beta-glucuronidase
Name:Beta-glucuronidase
Type:Protein
Mol. Mass.:68431.57
Organism:Escherichia coli (Enterobacteria)
Description:P05804
Residue:603
BDBM163637
NameBDBM163637
Synonyms:3[(6,7Dimethyl2oxo1,2dihydroquinolin3yl)methyl]3(2hydroxyethyl)1(3 methoxyphenyl)thiourea (Inh 2) | US9334288, 4
TypeSmall organic molecule
Emp. Form.C22H25N3O3S
Mol. Mass.411.517
SMILESCOc1cccc(NC(=S)N(CCO)Cc2cc3cc(C)c(C)cc3[nH]c2=O)c1