Reaction Details
TargetPancreatic alpha-amylase
LigandBDBM163650
Substrate/Competitorn/a
Meas. Tech.Kinetic Studies
Temperature303.15±0 K
Ki 79.3±9.5 nM
Citation Williams, LKZhang, XCaner, STysoe, CNguyen, NTWicki, JWilliams, DEColeman, JMcNeill, JHYuen, VAndersen, RJWithers, SGBrayer, GD The amylase inhibitor montbretin A reveals a new glycosidase inhibition motif. Nat Chem Biol11:691-6 (2015) 
 
Pancreatic alpha-amylase
Name:Pancreatic alpha-amylase
Type:Protein
Mol. Mass.:57709.71
Organism:Homo sapiens (Human)
Description:n/a
Residue:511
BDBM163650
NameBDBM163650
Synonyms:MbA-GR (4)
TypeSmall organic molecule
Emp. Form.C41H44O24
Mol. Mass.920.7737
SMILESC[C@@H]1O[C@@H](Oc2c(oc3cc(O)cc(O)c3c2=O)-c2cc(O)c(O[C@@H]3OC[C@@H](O)[C@H](O)[C@H]3O)c(O)c2)[C@H](O[C@@H]2O[C@H](COC(=O)\C=C\c3ccc(O)c(O)c3)[C@@H](O)[C@H](O)[C@H]2O)[C@H](O)[C@H]1O