Reaction Details
TargetPancreatic alpha-amylase
LigandBDBM163655
Substrate/Competitorn/a
Meas. Tech.Kinetic Studies
Temperature303.15±0 K
Ki 128000±15000 nM
Citation Williams, LKZhang, XCaner, STysoe, CNguyen, NTWicki, JWilliams, DEColeman, JMcNeill, JHYuen, VAndersen, RJWithers, SGBrayer, GD The amylase inhibitor montbretin A reveals a new glycosidase inhibition motif. Nat Chem Biol11:691-6 (2015) 
 
Pancreatic alpha-amylase
Name:Pancreatic alpha-amylase
Type:Protein
Mol. Mass.:57709.71
Organism:Homo sapiens (Human)
Description:n/a
Residue:511
BDBM163655
NameBDBM163655
Synonyms:MbA-CGR (9)
TypeSmall organic molecule
Emp. Form.C32H38O21
Mol. Mass.758.6315
SMILESC[C@@H]1O[C@@H](Oc2c(oc3cc(O)cc(O)c3c2=O)-c2cc(O)c(O[C@@H]3OC[C@@H](O)[C@H](O)[C@H]3O)c(O)c2)[C@H](O[C@@H]2O[C@H](CO)[C@@H](O)[C@H](O)[C@H]2O)[C@H](O)[C@H]1O