Reaction Details
TargetGlpG protein
LigandBDBM165194
Substrate/Competitorn/a
Meas. Tech.Activity-based Protein Profiling (ABPP)
pH7.4±0
Temperature310.15±0 K
IC50 7.6e+4± 2.8e+4 nM
Citation Wolf, EVZeissler, AVerhelst, SH Inhibitor Fingerprinting of Rhomboid Proteases by Activity-Based Protein Profiling Reveals Inhibitor Selectivity and Rhomboid Autoprocessing. ACS Chem Biol10:2325-33 (2015) 
 
GlpG protein
Name:GlpG protein
Synonyms:Rhomboid protease (VcROM)
Type:Protein
Mol. Mass.:31082.76
Organism:Vibrio cholerae (g-Proteobacteria)
Description:A0A085TGD0
Residue:277
BDBM165194
NameBDBM165194
Synonyms:4‐Chloro‐7‐nitro‐3‐[(5‐phenylpentyl)oxy]isochromen‐1‐one (21)
TypeSmall organic molecule
Emp. Form.C20H18ClNO5
Mol. Mass.387.814
SMILES[O-][N+](=O)c1ccc2c(Cl)c(OCCCCCc3ccccc3)oc(=O)c2c1