Reaction Details
TargetN-glycosylase/DNA lyase
LigandBDBM163682
Substrate/Competitorn/a
Meas. Tech.Gel-based Cleavage Assay
IC50 6.3e+2± 1.8e+2 nM
Citation Donley, NJaruga, PCoskun, EDizdaroglu, MMcCullough, AKLloyd, RS Small Molecule Inhibitors of 8-Oxoguanine DNA Glycosylase-1 (OGG1). ACS Chem Biol10:2334-43 (2015) 
 
N-glycosylase/DNA lyase
Name:N-glycosylase/DNA lyase
Type:Protein
Mol. Mass.:38794.33
Organism:Homo sapiens (Human)
Description:O15527
Residue:345
BDBM163682
NameBDBM163682
Synonyms:4‐Bromo‐N'‐cyclohexylidenebenzohydrazide (0151)
TypeSmall organic molecule
Emp. Form.C13H15BrN2O
Mol. Mass.295.175
SMILESBrc1ccc(cc1)-[#6](=O)-[#7]\[#7]=[#6]-1/[#6]-[#6]-[#6]-[#6]-[#6]-1