Reaction Details
TargetN-glycosylase/DNA lyase
LigandBDBM163689
Substrate/Competitorn/a
Meas. Tech.Fluorescence-based Assay
pH7.5±n/a
Temperature310.15±n/a K
IC50 3.78e+3± 8e+1 nM
Commentsextracted
Citation Donley, NJaruga, PCoskun, EDizdaroglu, MMcCullough, AKLloyd, RS Small Molecule Inhibitors of 8-Oxoguanine DNA Glycosylase-1 (OGG1). ACS Chem Biol10:2334-43 (2015) 
 
N-glycosylase/DNA lyase
Name:N-glycosylase/DNA lyase
Type:Protein
Mol. Mass.:38794.33
Organism:Homo sapiens (Human)
Description:O15527
Residue:345
BDBM163689
NameBDBM163689
Synonyms:3‐Bromo‐N'‐[(2Z)‐hex‐5‐en‐2‐ylidene]benzohydrazide (0155)
TypeSmall organic molecule
Emp. Form.C13H15BrN2O
Mol. Mass.295.175
SMILESC\C(CCC=C)=N\NC(=O)c1cccc(Br)c1