Reaction Details
TargetN-glycosylase/DNA lyase
LigandBDBM163690
Substrate/Competitorn/a
Meas. Tech.Fluorescence-based Assay
pH7.5±n/a
Temperature310.15±n/a K
IC50 2.13e+3± 2.9e+2 nM
Commentsextracted
Citation Donley, NJaruga, PCoskun, EDizdaroglu, MMcCullough, AKLloyd, RS Small Molecule Inhibitors of 8-Oxoguanine DNA Glycosylase-1 (OGG1). ACS Chem Biol10:2334-43 (2015) 
 
N-glycosylase/DNA lyase
Name:N-glycosylase/DNA lyase
Type:Protein
Mol. Mass.:38794.33
Organism:Homo sapiens (Human)
Description:O15527
Residue:345
BDBM163690
NameBDBM163690
Synonyms:3‐Bromo‐N'‐[(2Z)‐hexan‐2‐ylidene]benzohydrazide (0156)
TypeSmall organic molecule
Emp. Form.C13H17BrN2O
Mol. Mass.297.191
SMILESCCCC\C(C)=N/NC(=O)c1cccc(Br)c1