Reaction Details
TargetSignal transducer and activator of transcription 5B
LigandBDBM165192
Substrate/Competitorn/a
Meas. Tech.Fluorescence Polarization Assay
Ki 3.4e+2±7e+1 nM
IC50 750±10 nM
Citation Elumalai, NBerg, ARubner, SBerg, T Phosphorylation of Capsaicinoid Derivatives Provides Highly Potent and Selective Inhibitors of the Transcription Factor STAT5b. ACS Chem Biol10:2884-90 (2015) 
 
Signal transducer and activator of transcription 5B
Name:Signal transducer and activator of transcription 5B
Type:Protein
Mol. Mass.:89858.26
Organism:Homo sapiens (Human)
Description:n/a
Residue:787
BDBM165192
NameBDBM165192
Synonyms:4-((8-Methylnonanamido)methyl)-1,2-phenylene bis(dihydrogen phosphate) (6a)
Typen/a
Emp. Form.C17H29NO9P2
Mol. Mass.453.361
SMILESCC(C)CCCCCCC(=O)NCc1ccc(OP(O)(O)=O)c(OP(O)(O)=O)c1