Reaction Details
TargetcAMP and cAMP-inhibited cGMP 3',5'-cyclic phosphodiesterase 10A
LigandBDBM163741
Substrate/Competitorn/a
Meas. Tech.Inhibition Assay
Ki 0.04±n/a nM
Citation Cox, CDDudkin, VYKern, JLayton, MERaheem, IT Pyrimidine PDE10 inhibitors US Patent US9062059 Publication Date 6/23/2015
 
cAMP and cAMP-inhibited cGMP 3',5'-cyclic phosphodiesterase 10A
Name:cAMP and cAMP-inhibited cGMP 3',5'-cyclic phosphodiesterase 10A
Type:Protein
Mol. Mass.:88412.52
Organism:Homo sapiens (Human)
Description:Q9Y233
Residue:779
BDBM163741
NameBDBM163741
Synonyms:US9062059, 2-3
TypeSmall organic molecule
Emp. Form.C20H24N6O
Mol. Mass.364.4442
SMILESCc1ccc(nc1)[C@H]1C[C@@H]1COc1cc(NCc2cnn(C)c2)nc(C)n1