Reaction Details
TargetcAMP and cAMP-inhibited cGMP 3',5'-cyclic phosphodiesterase 10A
LigandBDBM163737
Substrate/Competitorn/a
Meas. Tech.Inhibition Assay
Ki 0.08±n/a nM
Citation Cox, CDDudkin, VYKern, JLayton, MERaheem, IT Pyrimidine PDE10 inhibitors US Patent US9062059 Publication Date 6/23/2015
 
cAMP and cAMP-inhibited cGMP 3',5'-cyclic phosphodiesterase 10A
Name:cAMP and cAMP-inhibited cGMP 3',5'-cyclic phosphodiesterase 10A
Type:Protein
Mol. Mass.:88412.52
Organism:Homo sapiens (Human)
Description:Q9Y233
Residue:779
BDBM163737
NameBDBM163737
Synonyms:US9062059, 9-2
TypeSmall organic molecule
Emp. Form.C21H24N6OS
Mol. Mass.408.52
SMILESCc1nnc(CNc2cc(OC[C@H]3C[C@@H]3c3ccc(cn3)C3CC3)nc(C)n2)s1