Reaction Details
TargetcAMP and cAMP-inhibited cGMP 3',5'-cyclic phosphodiesterase 10A
LigandBDBM127925
Substrate/Competitorn/a
Meas. Tech.Inhibition Assay
Temperature298.15±n/a K
IC50 0.18±n/a nM
Commentsextracted
Citation Kehler, JNielsen, JMarigo, MKilburn, JPLanggård, M Substituted imidazo[2,1-A]isoindoles as PDE10 inhibitors US Patent US9062060 Publication Date 6/23/2015
 
cAMP and cAMP-inhibited cGMP 3',5'-cyclic phosphodiesterase 10A
Name:cAMP and cAMP-inhibited cGMP 3',5'-cyclic phosphodiesterase 10A
Type:Protein
Mol. Mass.:88412.52
Organism:Homo sapiens (Human)
Description:Q9Y233
Residue:1055
BDBM127925
NameBDBM127925
Synonyms:US8796304, 2-[2-(5,8-Dimethyl-[1,2,4]triazolo[1,5-a]pyrazin-2-yl)-ethyl]-7-fluoro-5H-imidazo[2,1-a]isoindole | US9062060, Table 1, Compound 6
TypeSmall organic molecule
Emp. Form.C19H17FN6
Mol. Mass.348.3769
SMILESCc1cnc(C)c2nc(CCc3cn4Cc5cc(F)ccc5-c4n3)nn12