Reaction Details
TargetTyrosine-protein kinase Lck
LigandBDBM50430875
Substrate/Competitorn/a
Meas. Tech.Inhibition Assay
pH8±n/a
IC50 21.6±n/a nM
Commentsextracted
Citation Yang, BKim, YPark, TWoo, SLee, HKim, SCho, JLee, H Anti-inflammatory compound having inhibitory activity against multiple tyrosine kinases and pharmaceutical composition containing same US Patent US9062066 Publication Date 6/23/2015
 
Tyrosine-protein kinase Lck
Name:Tyrosine-protein kinase Lck
Type:n/a
Mol. Mass.:57987.83
Organism:Homo sapiens (Human)
Description:P06239
Residue:509
BDBM50430875
NameBDBM50430875
Synonyms:CHEMBL2336005 | US9062066, LCB 03-0110
TypeSmall organic molecule
Emp. Form.C24H23N3O2S
Mol. Mass.417.523
SMILESOc1cccc(Nc2ccnc3cc(sc23)-c2cccc(CN3CCOCC3)c2)c1