Reaction Details
TargetEphrin type-A receptor 3
LigandBDBM50430875
Substrate/Competitorn/a
Meas. Tech.Inhibition Assay
pH8±n/a
IC50 5.1±n/a nM
Commentsextracted
Citation Yang, BKim, YPark, TWoo, SLee, HKim, SCho, JLee, H Anti-inflammatory compound having inhibitory activity against multiple tyrosine kinases and pharmaceutical composition containing same US Patent US9062066 Publication Date 6/23/2015
 
Ephrin type-A receptor 3
Name:Ephrin type-A receptor 3
Type:Protein
Mol. Mass.:110131.95
Organism:Homo sapiens (Human)
Description:P29320
Residue:983
BDBM50430875
NameBDBM50430875
Synonyms:CHEMBL2336005 | US9062066, LCB 03-0110
TypeSmall organic molecule
Emp. Form.C24H23N3O2S
Mol. Mass.417.523
SMILESOc1cccc(Nc2ccnc3cc(sc23)-c2cccc(CN3CCOCC3)c2)c1