Reaction Details
TargetATP-sensitive inward rectifier potassium channel 1
LigandBDBM163759
Substrate/Competitorn/a
Meas. Tech.Electrophysiology Assay
pH7.4±n/a
IC50 60±n/a nM
Commentsextracted
Citation Pasternak, ABlizzard, TChobanian, Hde Jesus, RDing, FDong, SGude, CKim, DTang, HWalsh, SPio, BJiang, J Inhibitors of the renal outer medullary potassium channel US Patent US9062070 Publication Date 6/23/2015
 
ATP-sensitive inward rectifier potassium channel 1
Name:ATP-sensitive inward rectifier potassium channel 1
Type:Enzyme
Mol. Mass.:44976.27
Organism:Rattus norvegicus (Rat)
Description:P35560
Residue:391
BDBM163759
NameBDBM163759
Synonyms:US9062070, 15
TypeSmall organic molecule
Emp. Form.C23H24N8O2S
Mol. Mass.476.554
SMILESCc1c(csc1[N+]#[C-])[C@@H]1CN2CCN(C[C@H]2CO1)C(=O)C1CCc2nc(ccc12)-n1cnnn1