Reaction Details
TargetATP-sensitive inward rectifier potassium channel 1
LigandBDBM163857
Substrate/Competitorn/a
Meas. Tech.Thallium Flux Assay
Temperature310.15±n/a K
IC50 120±n/a nM
Commentsextracted
Citation Pasternak, ABlizzard, TChobanian, Hde Jesus, RDing, FDong, SGude, CKim, DTang, HWalsh, SPio, BJiang, J Inhibitors of the renal outer medullary potassium channel US Patent US9062070 Publication Date 6/23/2015
 
ATP-sensitive inward rectifier potassium channel 1
Name:ATP-sensitive inward rectifier potassium channel 1
Type:Enzyme
Mol. Mass.:44976.27
Organism:Rattus norvegicus (Rat)
Description:P35560
Residue:391
BDBM163857
NameBDBM163857
Synonyms:US9062070, 2A US9062070, 2C US9062070, 2E US9062070, 2G | US9062070, 2H
TypeSmall organic molecule
Emp. Form.C25H25FN8O2
Mol. Mass.488.5168
SMILESCc1c(ccc(F)c1[N+]#[C-])C1CN2CCN(CC2CO1)C(=O)C1CCc2nc(ccc12)-n1cnnn1