Reaction Details
TargetATP-sensitive inward rectifier potassium channel 1
LigandBDBM163850
Substrate/Competitorn/a
Meas. Tech.Thallium Flux Assay
Temperature310.15±n/a K
IC50 140±n/a nM
Commentsextracted
Citation Pasternak, ABlizzard, TChobanian, Hde Jesus, RDing, FDong, SGude, CKim, DTang, HWalsh, SPio, BJiang, J Inhibitors of the renal outer medullary potassium channel US Patent US9062070 Publication Date 6/23/2015
 
ATP-sensitive inward rectifier potassium channel 1
Name:ATP-sensitive inward rectifier potassium channel 1
Type:Enzyme
Mol. Mass.:44976.27
Organism:Rattus norvegicus (Rat)
Description:P35560
Residue:391
BDBM163850
NameBDBM163850
Synonyms:US9062070, 105 | US9062070, 106
TypeSmall organic molecule
Emp. Form.C25H26FN9O
Mol. Mass.487.532
SMILESCc1c(ccc(F)c1[N+]#[C-])[C@@H]1CN2CCN(C[C@@H]2CN1)C(=O)C1CCc2cc(ncc12)-n1cnnn1