Reaction Details
TargetHepatocyte growth factor receptor
LigandBDBM164403
Substrate/Competitorn/a
Meas. Tech.In Vitro Assay
pH8±n/a
Temperature300.15±n/a K
Ki 9.3±n/a nM
Commentsextracted
Citation Albrecht, BKBauer, DBellon, SBode, CMBooker, SBoezio, AChoquette, DD'Amico, DHarmange, JHirai, SHungate, RWKim, TLewis, RTLiu, LLohman, JWNorman, MHPotashman, MSiegmund, ACSpringer, SKStec, MXi, NYang, K Fused heterocyclic derivatives and methods of use US Patent US9066954 Publication Date 6/30/2015
 
Hepatocyte growth factor receptor
Name:Hepatocyte growth factor receptor
Type:Protein
Mol. Mass.:155559.73
Organism:Homo sapiens (Human)
Description:P08581
Residue:1390
BDBM164403
NameBDBM164403
Synonyms:US9066954, 17
TypeSmall organic molecule
Emp. Form.C25H18ClN7O3
Mol. Mass.499.909
SMILESCOc1ccc2c(OCc3nnc4ccc(nn34)-c3ccc(-c4nc(C)no4)c(Cl)c3)ccnc2c1