Reaction Details
TargetHepatocyte growth factor receptor
LigandBDBM24483
Substrate/Competitorn/a
Meas. Tech.In Vitro Assay
pH8±n/a
Temperature300.15±n/a K
Ki 1.6±n/a nM
Commentsextracted
Citation Albrecht, BKBauer, DBellon, SBode, CMBooker, SBoezio, AChoquette, DD'Amico, DHarmange, JHirai, SHungate, RWKim, TLewis, RTLiu, LLohman, JWNorman, MHPotashman, MSiegmund, ACSpringer, SKStec, MXi, NYang, K Fused heterocyclic derivatives and methods of use US Patent US9066954 Publication Date 6/30/2015
 
Hepatocyte growth factor receptor
Name:Hepatocyte growth factor receptor
Type:Protein
Mol. Mass.:155559.73
Organism:Homo sapiens (Human)
Description:P08581
Residue:1390
BDBM24483
NameBDBM24483
Synonyms:5-(3-{[(7-methoxyquinolin-4-yl)oxy]methyl}-[1,2,4]triazolo[4,3-a]pyridazin-6-yl)-3-methyl-1,2-thiazole US9066954, 222
TypeSmall organic molecule
Emp. Form.C20H16N6O2S
Mol. Mass.404.445
SMILESCOc1ccc2c(OCc3nnc4ccc(nn34)-c3cc(C)ns3)ccnc2c1