Reaction Details
TargetHepatocyte growth factor receptor
LigandBDBM164475
Substrate/Competitorn/a
Meas. Tech.In Vitro Assay
pH8±n/a
Temperature300.15±n/a K
Ki 2±n/a nM
Commentsextracted
Citation Albrecht, BKBauer, DBellon, SBode, CMBooker, SBoezio, AChoquette, DD'Amico, DHarmange, JHirai, SHungate, RWKim, TLewis, RTLiu, LLohman, JWNorman, MHPotashman, MSiegmund, ACSpringer, SKStec, MXi, NYang, K Fused heterocyclic derivatives and methods of use US Patent US9066954 Publication Date 6/30/2015
 
Hepatocyte growth factor receptor
Name:Hepatocyte growth factor receptor
Type:Protein
Mol. Mass.:155559.73
Organism:Homo sapiens (Human)
Description:P08581
Residue:1390
BDBM164475
NameBDBM164475
Synonyms:US9066954, 309
TypeSmall organic molecule
Emp. Form.C22H16N8OS
Mol. Mass.440.48
SMILESCOc1cnc2c(NCc3nnc4ccc(nn34)-c3ccc4ncsc4c3)ccnc2c1