Reaction Details
TargetHepatocyte growth factor receptor
LigandBDBM164488
Substrate/Competitorn/a
Meas. Tech.In Vitro Assay
pH8±n/a
Temperature300.15±n/a K
Ki 0.1±n/a nM
Commentsextracted
Citation Albrecht, BKBauer, DBellon, SBode, CMBooker, SBoezio, AChoquette, DD'Amico, DHarmange, JHirai, SHungate, RWKim, TLewis, RTLiu, LLohman, JWNorman, MHPotashman, MSiegmund, ACSpringer, SKStec, MXi, NYang, K Fused heterocyclic derivatives and methods of use US Patent US9066954 Publication Date 6/30/2015
 
Hepatocyte growth factor receptor
Name:Hepatocyte growth factor receptor
Type:Protein
Mol. Mass.:155559.73
Organism:Homo sapiens (Human)
Description:P08581
Residue:1390
BDBM164488
NameBDBM164488
Synonyms:US9066954, 373
TypeSmall organic molecule
Emp. Form.C24H18F2N10O
Mol. Mass.500.4629
SMILESFc1cc(F)cc(c1)-c1ccc2nnc(CNc3ccnc4cc(OCCn5cncn5)cnc34)n2n1