Reaction Details
TargetHigh affinity nerve growth factor receptor
LigandBDBM164944
Substrate/Competitorn/a
Meas. Tech.Inhibition Assay
pH7.5±n/a
Temperature298.15±n/a K
IC50 0.2±n/a nM
Commentsextracted
Citation Kane, Jr., JLMatthews, GMetz, MKothe, MLiu, JScholte, A Tropomyosin-related kinase (TRK) inhibitors US Patent US9067914 Publication Date 6/30/2015
 
High affinity nerve growth factor receptor
Name:High affinity nerve growth factor receptor
Type:n/a
Mol. Mass.:87498.18
Organism:Homo sapiens (Human)
Description:P04629
Residue:796
BDBM164944
NameBDBM164944
Synonyms:US10166239, Ex. 3-40-4 US9067914, Ex. 3-40-4
TypeSmall organic molecule
Emp. Form.C27H25F3N6O2
Mol. Mass.522.5216
SMILESCOc1cc(Cn2c(N)nc3cc(cnc23)-c2cnn(C)c2)ccc1OCc1ccc(CC(F)(F)F)cc1