Reaction Details
TargetHigh affinity nerve growth factor receptor
LigandBDBM164962
Substrate/Competitorn/a
Meas. Tech.Inhibition Assay
pH7.5±n/a
Temperature298.15±n/a K
IC50 0.4±n/a nM
Commentsextracted
Citation Kane, Jr., JLMatthews, GMetz, MKothe, MLiu, JScholte, A Tropomyosin-related kinase (TRK) inhibitors US Patent US9067914 Publication Date 6/30/2015
 
High affinity nerve growth factor receptor
Name:High affinity nerve growth factor receptor
Type:n/a
Mol. Mass.:87498.18
Organism:Homo sapiens (Human)
Description:P04629
Residue:796
BDBM164962
NameBDBM164962
Synonyms:US10166239, Ex. 3-53 US9067914, Ex. 3-53
TypeSmall organic molecule
Emp. Form.C26H24F3N7O2
Mol. Mass.523.5097
SMILESCOc1cc(ccc1OCc1ccc(nc1)C(F)(F)F)C(C)n1c(N)nc2cc(cnc12)-c1cnn(C)c1