Reaction Details
TargetMacrophage colony-stimulating factor 1 receptor
LigandBDBM164891
Substrate/Competitorn/a
Meas. Tech.Inhibition Assay
pH7.5±n/a
Temperature298.15±n/a K
IC50 2±n/a nM
Commentsextracted
Citation Kane, Jr., JLMatthews, GMetz, MKothe, MLiu, JScholte, A Tropomyosin-related kinase (TRK) inhibitors US Patent US9067914 Publication Date 6/30/2015
 
Macrophage colony-stimulating factor 1 receptor
Name:Macrophage colony-stimulating factor 1 receptor
Type:Protein
Mol. Mass.:107979.48
Organism:Homo sapiens (Human)
Description:P07333
Residue:972
BDBM164891
NameBDBM164891
Synonyms:US10166239, Ex. 3-5 US9067914, Ex. 3-5
TypeSmall organic molecule
Emp. Form.C30H32N6O3
Mol. Mass.524.6135
SMILESCOc1ccc(COc2ccc(Cn3cnc4cc(ccc34)-c3cnn(c3)C3CCNCC3)cc2OC)cn1